Target
Sensory histidine kinase DcuS
Ligand
BDBM50406360
Substrate
Meas. Tech.
ChEMBL_1738855 (CHEMBL4154605)
IC50
1430±n/a nM
Citation
 Hansen, AMPeng, PBaldry, MPerez-Gassol, IChristensen, SBVinther, JMOIngmer, HFranzyk, H Lactam hybrid analogues of solonamide B and autoinducing peptides as potent S. aureus AgrC antagonists. Eur J Med Chem 152:370-376 (2018)  
Target
Name:
Sensory histidine kinase DcuS
Synonyms:
Receptor-histidine kinase AgrC
Type:
PROTEIN
Mol. Mass.:
49890.25
Organism:
Staphylococcus aureus
Description:
ChEMBL_305973
Residue:
430
  
Inhibitor
Name:
BDBM50406360
Synonyms:
CHEMBL4167382
Type:
Small organic molecule
Emp. Form.:
C33H52N6O6
Mol. Mass.:
628.8026
SMILES:
CCCCCC(=O)N[C@@H]1CNC(=O)[C@@H](CC(C)C)NC(=O)[C@@H](C)NC(=O)[C@@H](CC(C)C)NC(=O)[C@@H](Cc2ccccc2)NC1=O
: