Target
Mu-type opioid receptor
Ligand
BDBM50001467
Substrate
Meas. Tech.
ChEBML_148992
Ki
10±n/a nM
Citation
 Schiller, PWNguyen, TMMaziak, LAWilkes, BCLemieux, C Structure-activity relationships of cyclic opioid peptide analogues containing a phenylalanine residue in the 3-position. J Med Chem 30:2094-9 (1987)  
Target
Name:
Mu-type opioid receptor
Synonyms:
MOR-1 Mu-type opioid receptor (MOR) OPRM_RAT Opioid receptor B Ror-b
Type:
G Protein-Coupled Receptor (GPCR)
Mol. Mass.:
44503.11
Organism:
Rattus norvegicus (rat)
Description:
Competition binding assays were carried out using membrane preparations from transfected HN9.10 cells that constitutively expressed the mu opioid receptor.
Residue:
398
  
Inhibitor
Name:
BDBM50001467
Synonyms:
12-[2-Amino-3-(4-hydroxy-phenyl)-propionylamino]-2-benzyl-3,7,13-trioxo-1,4,8triaza-cyclotridecane-5-carboxylic acid amide | CHEMBL63407
Type:
Small organic molecule
Emp. Form.:
C27H34N6O6
Mol. Mass.:
538.5955
SMILES:
N[C@@H](Cc1ccc(O)cc1)C(=O)N[C@@H]1CCCNC(=O)C[C@H](NC(=O)[C@H](Cc2ccccc2)NC1=O)C(N)=O
: