Target
Sigma non-opioid intracellular receptor 1
Ligand
BDBM50450651
Substrate
Meas. Tech.
ChEMBL_1742998 (CHEMBL4158748)
Ki
6.3±n/a nM
Citation
 Bergkemper, MKronenberg, EThum, SBörgel, FDaniliuc, CSchepmann, DNieto, FRBrust, PReinoso, RFAlvarez, IWünsch, B Synthesis, Receptor Affinity, and Antiallodynic Activity of Spirocyclic ? Receptor Ligands with Exocyclic Amino Moiety. J Med Chem 61:9666-9690 (2018)  
Target
Name:
Sigma non-opioid intracellular receptor 1
Synonyms:
OPRS1 SIGMAR1 Sigma non-opioid intracellular receptor 1 Sigma1-receptor Sterol isomerase-like protein
Type:
Protein
Mol. Mass.:
25307.17
Organism:
Cavia porcellus (Guinea pig)
Description:
Q60492
Residue:
223
  
Inhibitor
Name:
BDBM50450651
Synonyms:
CHEMBL4175947
Type:
Small organic molecule
Emp. Form.:
C25H38N2O2
Mol. Mass.:
398.5814
SMILES:
CO[C@@H]1Cc2ccccc2C2(CC[C@@H](CC2)N2CCN(CC2)C2CCCCC2)O1
: