Target
Sigma intracellular receptor 2
Ligand
BDBM50450660
Substrate
Meas. Tech.
ChEMBL_1742999 (CHEMBL4158749)
Ki
302±n/a nM
Citation
 Bergkemper, MKronenberg, EThum, SBörgel, FDaniliuc, CSchepmann, DNieto, FRBrust, PReinoso, RFAlvarez, IWünsch, B Synthesis, Receptor Affinity, and Antiallodynic Activity of Spirocyclic ? Receptor Ligands with Exocyclic Amino Moiety. J Med Chem 61:9666-9690 (2018)  
Target
Name:
Sigma intracellular receptor 2
Synonyms:
S2r Sigma intracellular receptor 2 Sigma2 receptor Transmembrane protein 97
Type:
Protein
Mol. Mass.:
20953.88
Organism:
Rattus norvegicus (Rat)
Description:
Q5U3Y7
Residue:
176
  
Inhibitor
Name:
BDBM50450660
Synonyms:
CHEMBL4170826
Type:
Small organic molecule
Emp. Form.:
C24H36N2O2
Mol. Mass.:
384.5548
SMILES:
O[C@@H]1Cc2ccccc2C2(CC[C@@H](CC2)N2CCN(CC2)C2CCCCC2)O1
: