Target
Sigma intracellular receptor 2
Ligand
BDBM50450672
Substrate
Meas. Tech.
ChEMBL_1742999 (CHEMBL4158749)
Ki
305±n/a nM
Citation
 Bergkemper, MKronenberg, EThum, SBörgel, FDaniliuc, CSchepmann, DNieto, FRBrust, PReinoso, RFAlvarez, IWünsch, B Synthesis, Receptor Affinity, and Antiallodynic Activity of Spirocyclic ? Receptor Ligands with Exocyclic Amino Moiety. J Med Chem 61:9666-9690 (2018)  
Target
Name:
Sigma intracellular receptor 2
Synonyms:
S2r Sigma intracellular receptor 2 Sigma2 receptor Transmembrane protein 97
Type:
Protein
Mol. Mass.:
20953.88
Organism:
Rattus norvegicus (Rat)
Description:
Q5U3Y7
Residue:
176
  
Inhibitor
Name:
BDBM50450672
Synonyms:
CHEMBL4159559
Type:
Small organic molecule
Emp. Form.:
C27H34FNO
Mol. Mass.:
407.5634
SMILES:
FCC[C@@H]1Cc2ccccc2C2(CC[C@@H](CC2)NC2CCc3ccccc3CC2)O1
: