Target
Sodium channel protein type 5 subunit alpha
Ligand
BDBM50017659
Substrate
Meas. Tech.
ChEMBL_1745659 (CHEMBL4180169)
IC50
200±n/a nM
Citation
 Teng, MWu, WLi, ZYang, GQin, JWang, YHu, ZDong, HHou, LHu, GShen, LZhang, YLi, JChen, STian, JYe, LZhang, JWang, H Discovery of aminocyclohexene analogues as selective and orally bioavailable hNav1.7 inhibitors for analgesia. Bioorg Med Chem Lett 27:4979-4984 (2017)  
Target
Name:
Sodium channel protein type 5 subunit alpha
Synonyms:
HH1 SCN5A_HUMAN Sodium channel protein type 5 subunit alpha/beta-1/beta-2 Voltage-gated sodium channel subunit alpha Nav1.5
Type:
Enzyme
Mol. Mass.:
226908.60
Organism:
Homo sapiens (Human)
Description:
Q14524
Residue:
2016
  
Inhibitor
Name:
BDBM50017659
Synonyms:
2-(Dimethylamino)ethyl p-(butylamino)benzoate CHEMBL698 TETRACAINE | p-Butylaminobenzoyl-2-dimethylaminoethanol
Type:
Small organic molecule
Emp. Form.:
C15H24N2O2
Mol. Mass.:
264.3633
SMILES:
CCCCNc1ccc(cc1)C(=O)OCCN(C)C
: