Target
Amine oxidase [flavin-containing] B
Ligand
BDBM50456646
Substrate
Meas. Tech.
ChEMBL_1757753 (CHEMBL4192761)
IC50
3742±n/a nM
Citation
 Yang, HLCai, PLiu, QHYang, XLLi, FWang, JWu, JJWang, XBKong, LY Design, synthesis and evaluation of coumarin-pargyline hybrids as novel dual inhibitors of monoamine oxidases and amyloid-? aggregation for the treatment of Alzheimer's disease. Eur J Med Chem 138:715-728 (2017)  
Target
Name:
Amine oxidase [flavin-containing] B
Synonyms:
AOFB_HUMAN MAOB Monoamine oxidase type B (MAO B) Monoamine oxidase type B (MAOB)
Type:
Protein
Mol. Mass.:
58768.76
Organism:
Homo sapiens (Human)
Description:
P27338
Residue:
520
  
Inhibitor
Name:
BDBM50456646
Synonyms:
CHEMBL4217159
Type:
Small organic molecule
Emp. Form.:
C22H21NO3
Mol. Mass.:
347.407
SMILES:
O=c1ccc2ccc(OCCCN(CC#C)Cc3ccccc3)cc2o1
: