Target
Histamine H1 receptor
Ligand
BDBM22875
Substrate
Meas. Tech.
ChEMBL_1760112 (CHEMBL4195120)
Ki
2.0±n/a nM
Citation
 Pa?czyk, KPytka, KJakubczyk, MRapacz, ASa?at, KFurga?a, ASiwek, AG?uch-Lutwin, MGrybo?, AS?oczy?ska, KP?kala, E?mudzki, PBucki, AKo?aczkowski, M?elaszczyk, DMarona, HWaszkielewicz, AM Synthesis and activity of di- or trisubstituted N-(phenoxyalkyl)- or N-{2-[2-(phenoxy)ethoxy]ethyl}piperazine derivatives on the central nervous system. Bioorg Med Chem Lett 28:2039-2049 (2018)  
Target
Name:
Histamine H1 receptor
Synonyms:
H1R HISTAMINE H1 HRH1_HUMAN
Type:
G Protein-Coupled Receptor (GPCR)
Mol. Mass.:
55808.72
Organism:
Homo sapiens (Human)
Description:
Cell pellets from SK-N-MC cells transfected with human H1 receptor were used in binding assay.
Residue:
487
  
Inhibitor
Name:
BDBM22875
Synonyms:
2-(2-{4-[(4-chlorophenyl)(phenyl)methyl]piperazin-1-yl}ethoxy)ethan-1-ol CHEMBL896 Hydroxyzine Hydroxyzine, (R) Vistaril | med.21724, Compound 187
Type:
Small organic molecule
Emp. Form.:
C21H27ClN2O2
Mol. Mass.:
374.904
SMILES:
OCCOCCN1CCN(CC1)C(c1ccccc1)c1ccc(Cl)cc1
: