Target
DNA (cytosine-5)-methyltransferase 1
Ligand
BDBM50457739
Substrate
Meas. Tech.
ChEMBL_1760555 (CHEMBL4195563)
IC50
83±n/a nM
Citation
 Rabal, OSánchez-Arias, JASan José-Enériz, EAgirre, Xde Miguel, IGarate, LMiranda, ESáez, ERoa, SMartínez-Climent, JALiu, YWu, WXu, MProsper, FOyarzabal, J Detailed Exploration around 4-Aminoquinolines Chemical Space to Navigate the Lysine Methyltransferase G9a and DNA Methyltransferase Biological Spaces. J Med Chem 61:6546-6573 (2018)  
Target
Name:
DNA (cytosine-5)-methyltransferase 1
Synonyms:
AIM CXXC9 DNA (cytosine-5)-methyltransferase 1 isoform b DNA methyltransferase HsaI DNMT1 M.HsaI | MCMT
Type:
Enzyme
Mol. Mass.:
183184.85
Organism:
Homo sapiens (Human)
Description:
P26358
Residue:
1616
  
Inhibitor
Name:
BDBM50457739
Synonyms:
CHEMBL4203133
Type:
Small organic molecule
Emp. Form.:
C28H38N4O3
Mol. Mass.:
478.6263
SMILES:
COc1cc2c(NC3CCN(C)CC3)cc(nc2cc1OCC1CCN(C)CC1)-c1ccc(C)o1
: