Target
Renin
Ligand
BDBM50022040
Substrate
Meas. Tech.
ChEMBL_192892 (CHEMBL795931)
IC50
290±n/a nM
Citation
 Bock, MGDiPardo, RMEvans, BEFreidinger, RMRittle, KEPayne, LSBoger, JWhitter, WLLaMont, BIUlm, EH Renin inhibitors containing hydrophilic groups. Tetrapeptides with enhanced aqueous solubility and nanomolar potency. J Med Chem 31:1918-23 (1988)  
Target
Name:
Renin
Synonyms:
Angiotensinogenase RENI_HUMAN
Type:
Enzyme
Mol. Mass.:
45058.99
Organism:
Homo sapiens (Human)
Description:
Residue:
406
  
Inhibitor
Name:
BDBM50022040
Synonyms:
CHEMBL3085571 | {1-[1-(1-{2-[1-(1-Carbamoyl-2-phenyl-ethylcarbamoyl)-3-methyl-butylcarbamoyl]-1-hydroxy-ethyl}-3-methyl-butylcarbamoyl)-2-(1H-imidazol-4-yl)-ethylcarbamoyl]-2-phenyl-ethyl}-carbamic acid tert-butyl ester
Type:
Small organic molecule
Emp. Form.:
C43H62N8O8
Mol. Mass.:
819.0012
SMILES:
CC(C)C[C@H](NC(=O)[C@H](Cc1c[nH]cn1)NC(=O)[C@H](Cc1ccccc1)NC(=O)OC(C)(C)C)[C@@H](O)CC(=O)N[C@@H](CC(C)C)C(=O)N[C@@H](Cc1ccccc1)C(N)=O
: