Target
Histone deacetylase 1
Ligand
BDBM50439674
Substrate
Meas. Tech.
ChEMBL_1763649 (CHEMBL4198896)
IC50
58±n/a nM
Citation
 Rabal, OSánchez-Arias, JACuadrado-Tejedor, Mde Miguel, IPérez-González, MGarcía-Barroso, CUgarte, AEstella-Hermoso de Mendoza, ASáez, EEspelosin, MUrsua, SHaizhong, TWei, WMusheng, XGarcia-Osta, AOyarzabal, J Design, synthesis, biological evaluation and in vivo testing of dual phosphodiesterase 5 (PDE5) and histone deacetylase 6 (HDAC6)-selective inhibitors for the treatment of Alzheimer's disease. Eur J Med Chem 150:506-524 (2018)  
Target
Name:
Histone deacetylase 1
Synonyms:
Cereblon/Histone deacetylase 1 HDAC1 Histone deacetylase 1 (HDAC1) RPD3L1
Type:
Enzyme
Mol. Mass.:
55090.27
Organism:
Homo sapiens (Human)
Description:
Q13547
Residue:
482
  
Inhibitor
Name:
BDBM50439674
Synonyms:
RICOLINOSTAT US11207431, Example E US8609678, 2-(diphenylamino)-N-(7-(hydroxyamino)-7-oxoheptyl)pyrimidine-5-carboxamide [26]
Type:
Small organic molecule
Emp. Form.:
C24H27N5O3
Mol. Mass.:
433.5029
SMILES:
ONC(=O)CCCCCCNC(=O)c1cnc(nc1)N(c1ccccc1)c1ccccc1
: