Target
Glutathione S-transferase omega-1
Ligand
BDBM50458522
Substrate
Meas. Tech.
ChEMBL_1764011 (CHEMBL4199258)
IC50
40±n/a nM
Citation
 Xie, YDahlin, JLOakley, AJCasarotto, MGBoard, PGBaell, JB Reviewing Hit Discovery Literature for Difficult Targets: Glutathione Transferase Omega-1 as an Example. J Med Chem 61:7448-7470 (2018)  
Target
Name:
Glutathione S-transferase omega-1
Synonyms:
GSTO 1-1 GSTO1_HUMAN Glutathione S-transferase omega-1 glutathione S-transferase omega-1 isoform 1
Type:
PROTEIN
Mol. Mass.:
27565.54
Organism:
Homo sapiens (Human)
Description:
EBI_11172
Residue:
241
  
Inhibitor
Name:
BDBM50458522
Synonyms:
CHEMBL4203414
Type:
Small organic molecule
Emp. Form.:
C29H32O5
Mol. Mass.:
460.5614
SMILES:
CC(C)CCCC(C)CCOc1ccc2c(ccc3oc(cc(=O)c23)C2(O)C=CC(=O)C=C2)c1
: