Target
Bromodomain-containing protein 4
Ligand
BDBM284982
Substrate
Meas. Tech.
ChEMBL_1771644 (CHEMBL4223756)
IC50
2990±n/a nM
Citation
 Bennett, MJWu, YBoloor, AMatuszkiewicz, JO'Connell, SMShi, LStansfield, RKDel Rosario, JRVeal, JMHosfield, DJXu, JKaldor, SWStafford, JABetancort, JM Design, synthesis and biological evaluation of novel 4-phenylisoquinolinone BET bromodomain inhibitors. Bioorg Med Chem Lett 28:1811-1816 (2018)  
Target
Name:
Bromodomain-containing protein 4
Synonyms:
BRD4 Bromodomain-containing protein 4 (BRD4) Protein HUNK1
Type:
Protein
Mol. Mass.:
152264.84
Organism:
Homo sapiens (Human)
Description:
O60885
Residue:
1362
  
Inhibitor
Name:
BDBM284982
Synonyms:
N-benzyl-3-(2-methyl-1-oxoisoquinolin-4-yl) benzenesulfonamide | US10023592, Example 27
Type:
Small organic molecule
Emp. Form.:
C23H20N2O3S
Mol. Mass.:
404.482
SMILES:
Cn1cc(-c2cccc(c2)S(=O)(=O)NCc2ccccc2)c2ccccc2c1=O
: