Target
Prostaglandin G/H synthase 2
Ligand
BDBM50009859
Substrate
Meas. Tech.
ChEMBL_1776567 (CHEMBL4233559)
IC50
1400±n/a nM
Citation
 Navarro, LRosell, GSánchez, SBoixareu, NPors, KPouplana, RCampanera, JMPujol, MD Synthesis and biological properties of aryl methyl sulfones. Bioorg Med Chem 26:4113-4126 (2018)  
Target
Name:
Prostaglandin G/H synthase 2
Synonyms:
COX2 Cyclooxygenase-2 (COX-2) PTGS2 Prostaglandin G/H synthase (cyclooxygenase)
Type:
Protein
Mol. Mass.:
68976.98
Organism:
Ovis aries (Sheep)
Description:
Residue:
603
  
Inhibitor
Name:
BDBM50009859
Synonyms:
(+-)-2-(p-isobutylphenyl)propionic acid (+-)-ibuprofen (4-isobutylphenyl)-alpha-methylacetic acid 2-(4-isobutylphenyl)propanoic acid 4-isobutylhydratropic acid Brufen IBUPROFEN LYSINE Ibuprofen (1) alpha-(4-isobutylphenyl)propionic acid | alpha-(p-isobutylphenyl)propionic acid
Type:
Small organic molecule
Emp. Form.:
C13H18O2
Mol. Mass.:
206.2808
SMILES:
CC(C)Cc1ccc(cc1)C(C)C(O)=O
: