Target
TYR_PHOSPHATASE_2 domain-containing protein
Ligand
BDBM50242014
Substrate
Meas. Tech.
ChEMBL_1782399 (CHEMBL4253916)
IC50
5248±n/a nM
Citation
 Mascarello, AOrbem Menegatti, ACCalcaterra, AMartins, PGAChiaradia-Delatorre, LDD'Acquarica, IFerrari, FPau, VSanna, ADe Logu, ABotta, MBotta, BTerenzi, HMori, M Naturally occurring Diels-Alder-type adducts from Morus nigra as potent inhibitors of Mycobacterium tuberculosis protein tyrosine phosphatase B. Eur J Med Chem 144:277-288 (2018)  
Target
Name:
TYR_PHOSPHATASE_2 domain-containing protein
Synonyms:
(PROTEIN-TYROSINE-PHOSPHATASE) (PTPase) PHOSPHOTYROSINE PROTEIN PHOSPHATASE PTPB Phosphotyrosine-protein phosphatase PTPB | Protein Tyrosine Phosphatase PTPB
Type:
Hydrolase
Mol. Mass.:
30152.45
Organism:
Mycobacterium tuberculosis
Description:
Residue:
276
  
Inhibitor
Name:
BDBM50242014
Synonyms:
CHEMBL464006 Morusin, 3 cid_5281671
Type:
Small organic molecule
Emp. Form.:
C25H24O6
Mol. Mass.:
420.4545
SMILES:
[#6]\[#6](-[#6])=[#6]\[#6]-c1c(oc2c3-[#6]=[#6]C([#6])([#6])[#8]-c3cc(-[#8])c2c1=O)-c1ccc(-[#8])cc1-[#8]
: