Target
Dihydrofolate reductase
Ligand
BDBM50405399
Substrate
Meas. Tech.
ChEBML_54892
IC50
35.0±n/a nM
Citation
 DeGraw, JIChristie, PHTagawa, HKisliuk, RLGaumont, YSchmid, FASirotnak, FM Synthesis and biological activity of resolved C-10 diastereomers of 10-methyl- and 10-ethyl-10-deazaminopterin. J Med Chem 29:1056-61 (1986)  
Target
Name:
Dihydrofolate reductase
Synonyms:
DYR_LACCA folA
Type:
PROTEIN
Mol. Mass.:
18437.08
Organism:
Lactobacillus casei
Description:
ChEMBL_1357878
Residue:
163
  
Inhibitor
Name:
BDBM50405399
Synonyms:
CHEMBL2051989
Type:
Small organic molecule
Emp. Form.:
C22H29N7O5
Mol. Mass.:
471.5096
SMILES:
CC[C@H](CC1CNc2nc(N)nc(N)c2N1)c1ccc(cc1)C(=O)N[C@@H](CCC(O)=O)C(O)=O
: