Target
Dihydrofolate reductase
Ligand
BDBM50226274
Substrate
Meas. Tech.
ChEMBL_54892 (CHEMBL666945)
IC50
14±n/a nM
Citation
 DeGraw, JIChristie, PHTagawa, HKisliuk, RLGaumont, YSchmid, FASirotnak, FM Synthesis and biological activity of resolved C-10 diastereomers of 10-methyl- and 10-ethyl-10-deazaminopterin. J Med Chem 29:1056-61 (1986)  
Target
Name:
Dihydrofolate reductase
Synonyms:
DYR_LACCA folA
Type:
PROTEIN
Mol. Mass.:
18437.08
Organism:
Lactobacillus casei
Description:
ChEMBL_1357878
Residue:
163
  
Inhibitor
Name:
BDBM50226274
Synonyms:
CHEMBL3349020
Type:
Small organic molecule
Emp. Form.:
C22H25N7O5
Mol. Mass.:
467.4778
SMILES:
CC[C@H](Cc1cnc2nc(N)nc(N)c2n1)c1ccc(cc1)C(=O)N[C@@H](CCC(O)=O)C(O)=O
: