Target
Proprotein convertase subtilisin/kexin type 6
Ligand
BDBM50466079
Substrate
Meas. Tech.
ChEMBL_1789727 (CHEMBL4261461)
Ki
2.6±n/a nM
Citation
 Dianati, VNavals, PCouture, FDesjardins, RDame, AKwiatkowska, ADay, RDory, YL Improving the Selectivity of PACE4 Inhibitors through Modifications of the P1 Residue. J Med Chem 61:11250-11260 (2018)  
Target
Name:
Proprotein convertase subtilisin/kexin type 6
Synonyms:
PACE4 PCSK6_HUMAN | Subtilisin/kexin type 6
Type:
PROTEIN
Mol. Mass.:
106442.22
Organism:
Homo sapiens (Human)
Description:
ChEMBL_1290742
Residue:
969
  
Inhibitor
Name:
BDBM50466079
Synonyms:
CHEMBL4286124
Type:
Small organic molecule
Emp. Form.:
C50H89N15O8
Mol. Mass.:
1028.3374
SMILES:
CC(C)C[C@@H](NC(C)=O)C(=O)N[C@@H](CC(C)C)C(=O)N[C@@H](CC(C)C)C(=O)N[C@@H](CC(C)C)C(=O)N[C@@H](CCCNC(N)=N)C(=O)N[C@@H](C(C)C)C(=O)N[C@@H](CCCCN)C(=O)NCc1ccc(nc1)C(N)=N
: