Target
Cytidine deaminase
Ligand
BDBM50025459
Substrate
Meas. Tech.
ChEBML_217550
Ki
4000.0±n/a nM
Citation
 Kelley, JADriscoll, JSMcCormack, JJRoth, JSMarquez, VE Furanose-pyranose isomerization of reduced pyrimidine and cyclic urea ribosides. J Med Chem 29:2351-8 (1986)  
Target
Name:
Cytidine deaminase
Synonyms:
CDD_MOUSE Cdd | Cytidine aminohydrolase
Type:
PROTEIN
Mol. Mass.:
16129.75
Organism:
Mus musculus
Description:
ChEMBL_52531
Residue:
146
  
Inhibitor
Name:
BDBM50025459
Synonyms:
1-(3,4-Dihydroxy-5-hydroxymethyl-tetrahydro-furan-2-yl)-tetrahydro-pyrimidin-2-one | CHEMBL2367575
Type:
Small organic molecule
Emp. Form.:
C9H16N2O5
Mol. Mass.:
232.2337
SMILES:
OC[C@H]1O[C@H]([C@H](O)[C@@H]1O)N1CCCNC1=O
: