Target
Cytidine deaminase
Ligand
BDBM50025461
Substrate
Meas. Tech.
ChEBML_217550
Ki
20000±n/a nM
Citation
 Kelley, JADriscoll, JSMcCormack, JJRoth, JSMarquez, VE Furanose-pyranose isomerization of reduced pyrimidine and cyclic urea ribosides. J Med Chem 29:2351-8 (1986)  
Target
Name:
Cytidine deaminase
Synonyms:
CDD_MOUSE Cdd | Cytidine aminohydrolase
Type:
PROTEIN
Mol. Mass.:
16129.75
Organism:
Mus musculus
Description:
ChEMBL_52531
Residue:
146
  
Inhibitor
Name:
BDBM50025461
Synonyms:
4-Hydroxy-1-(3,4,5-trihydroxy-tetrahydro-pyran-2-yl)-tetrahydro-pyrimidin-2-one; compound with 1-(3,4-dihydroxy-5-hydroxymethyl-tetrahydro-furan-2-yl)-4-hydroxy-tetrahydro-pyrimidin-2-one | CHEMBL308774
Type:
Small organic molecule
Emp. Form.:
C9H16N2O6
Mol. Mass.:
248.2331
SMILES:
OC1CCN([C@@H]2OC[C@@H](O)[C@@H](O)[C@H]2O)C(=O)N1
: