Target
cGMP-specific 3',5'-cyclic phosphodiesterase
Ligand
BDBM50467490
Substrate
Meas. Tech.
ChEMBL_1796376 (CHEMBL4268493)
EC50
71±n/a nM
Citation
 Zheng, HWu, YSun, BCheng, CQiao, YJiang, YZhao, SXie, ZTan, JLou, H Discovery of furyl/thienyl ?-carboline derivatives as potent and selective PDE5 inhibitors with excellent vasorelaxant effect. Eur J Med Chem 158:767-780 (2018)  
Target
Name:
cGMP-specific 3',5'-cyclic phosphodiesterase
Synonyms:
PDE5A_RAT Pde5a | Phosphodiesterase 5A
Type:
PROTEIN
Mol. Mass.:
94547.60
Organism:
Rattus norvegicus
Description:
ChEMBL_155367
Residue:
833
  
Inhibitor
Name:
BDBM50467490
Synonyms:
CHEMBL4278136
Type:
Small organic molecule
Emp. Form.:
C20H19N3O2S
Mol. Mass.:
365.449
SMILES:
[H][C@]12Cc3c([nH]c4ccccc34)[C@H](N1C(=O)CN(C)C2=O)c1ccc(C)s1
: