Target
cGMP-specific 3',5'-cyclic phosphodiesterase
Ligand
BDBM50467491
Substrate
Meas. Tech.
ChEMBL_1796376 (CHEMBL4268493)
EC50
225±n/a nM
Citation
 Zheng, HWu, YSun, BCheng, CQiao, YJiang, YZhao, SXie, ZTan, JLou, H Discovery of furyl/thienyl ?-carboline derivatives as potent and selective PDE5 inhibitors with excellent vasorelaxant effect. Eur J Med Chem 158:767-780 (2018)  
Target
Name:
cGMP-specific 3',5'-cyclic phosphodiesterase
Synonyms:
PDE5A_RAT Pde5a | Phosphodiesterase 5A
Type:
PROTEIN
Mol. Mass.:
94547.60
Organism:
Rattus norvegicus
Description:
ChEMBL_155367
Residue:
833
  
Inhibitor
Name:
BDBM50467491
Synonyms:
CHEMBL4289291
Type:
Small organic molecule
Emp. Form.:
C21H21N3O3
Mol. Mass.:
363.4097
SMILES:
[H][C@]12Cc3c([nH]c4ccccc34)[C@H](N1C(=O)N(CC)C2=O)c1ccc(CC)o1
: