Target
cGMP-specific 3',5'-cyclic phosphodiesterase
Ligand
BDBM14777
Substrate
Meas. Tech.
ChEMBL_1796376 (CHEMBL4268493)
EC50
78±n/a nM
Citation
 Zheng, HWu, YSun, BCheng, CQiao, YJiang, YZhao, SXie, ZTan, JLou, H Discovery of furyl/thienyl ?-carboline derivatives as potent and selective PDE5 inhibitors with excellent vasorelaxant effect. Eur J Med Chem 158:767-780 (2018)  
Target
Name:
cGMP-specific 3',5'-cyclic phosphodiesterase
Synonyms:
PDE5A_RAT Pde5a | Phosphodiesterase 5A
Type:
PROTEIN
Mol. Mass.:
94547.60
Organism:
Rattus norvegicus
Description:
ChEMBL_155367
Residue:
833
  
Inhibitor
Name:
BDBM14777
Synonyms:
(2R,8R)-2-(2H-1,3-benzodioxol-5-yl)-6-methyl-3,6,17-triazatetracyclo[8.7.0.0^{3,8}.0^{11,16}]heptadeca-1(10),11(16),12,14-tetraene-4,7-dione CHEMBL779 GF 196960 | Tadalafil
Type:
Small organic molecule
Emp. Form.:
C22H19N3O4
Mol. Mass.:
389.404
SMILES:
[H][C@]12Cc3c([nH]c4ccccc34)[C@H](N1C(=O)CN(C)C2=O)c1ccc2OCOc2c1
: