Target
Aldo-keto reductase family 1 member B1
Ligand
BDBM50025978
Substrate
Meas. Tech.
ChEMBL_31774 (CHEMBL643100)
IC50
1800±n/a nM
Citation
 Kador, PFKinoshita, JHSharpless, NE Aldose reductase inhibitors: a potential new class of agents for the pharmacological control of certain diabetic complications. J Med Chem 28:841-9 (1985)  
Target
Name:
Aldo-keto reductase family 1 member B1
Synonyms:
AKR1B1 ALDR_HUMAN AR Aldose Reductase (ALR2) Aldose reductase (AR)
Type:
Protein
Mol. Mass.:
35855.50
Organism:
Homo sapiens (Human)
Description:
P15121. 4LAU; 2IKI; 4LB4; 2FZD; 2FZ8; 1US0
Residue:
316
  
Inhibitor
Name:
BDBM50025978
Synonyms:
7-Hydroxy-4-oxo-4H-chromene-2-carboxylic acid | CHEMBL171055
Type:
Small organic molecule
Emp. Form.:
C10H6O5
Mol. Mass.:
206.1516
SMILES:
OC(=O)c1cc(=O)c2ccc(O)cc2o1
: