Target
Beta-secretase 1
Ligand
BDBM50164512
Substrate
Meas. Tech.
ChEMBL_1797909 (CHEMBL4270026)
Ki
1.000000±n/a nM
Citation
 Mandal, MMitra, KGrotz, DLin, XPalamanda, JKumari, PBuevich, ACaldwell, JPChen, XCox, KFavreau, LHyde, LKennedy, MEKuvelkar, RLiu, XMazzola, RDParker, ERindgen, DSherer, EWang, HZhu, ZStamford, AWCumming, JN Overcoming Time-Dependent Inhibition (TDI) of Cytochrome P450 3A4 (CYP3A4) Resulting from Bioactivation of a Fluoropyrimidine Moiety. J Med Chem 61:10700-10708 (2018)  
Target
Name:
Beta-secretase 1
Synonyms:
ASP2 Aspartyl protease 2 BACE1 Beta-secretase (BACE) Beta-secretase 1 (BACE 1) Beta-secretase 1 (BACE1) Beta-site amyloid precursor protein cleaving enzyme 1 Memapsin-2 beta-Secretase (BACE-1) | beta-Secretase (BACE1)
Type:
Protein
Mol. Mass.:
55755.10
Organism:
Homo sapiens (Human)
Description:
P56817
Residue:
501
  
Inhibitor
Name:
BDBM50164512
Synonyms:
CHEMBL3800286
Type:
Small organic molecule
Emp. Form.:
C23H20FN7O2S
Mol. Mass.:
477.514
SMILES:
[H][C@@]12CN(C[C@@]1(NC(=N)N(C)C2=O)c1cc(cs1)-c1cccc(c1)C#N)c1ncc(F)c(OC)n1
: