Target
Transitional endoplasmic reticulum ATPase
Ligand
BDBM50468106
Substrate
Meas. Tech.
ChEMBL_1798112 (CHEMBL4270229)
IC50
20±n/a nM
Citation
 LaPorte, MGBurnett, JCColombo, RBulfer, SLAlverez, CChou, TFNeitz, RJGreen, NMoore, WJYue, ZLi, SArkin, MRWipf, PHuryn, DM Optimization of Phenyl Indole Inhibitors of the AAA+ ATPase p97. ACS Med Chem Lett 9:1075-1081 (2018)  
Target
Name:
Transitional endoplasmic reticulum ATPase
Synonyms:
TERA_HUMAN VCP Valosin-containing protein
Type:
Enzyme
Mol. Mass.:
89300.63
Organism:
Homo sapiens (Human)
Description:
P55072
Residue:
806
  
Inhibitor
Name:
BDBM50468106
Synonyms:
CHEMBL4280801 | US11247985, Table 3.49
Type:
Small organic molecule
Emp. Form.:
C29H38FN5
Mol. Mass.:
475.6439
SMILES:
CN1CCN(CC1)C1(CNC2CCN(CC2)c2cccc(c2)-c2cc3cc(F)ccc3[nH]2)CCC1
: