Target
5-hydroxytryptamine receptor 1A
Ligand
BDBM50469881
Substrate
Meas. Tech.
ChEMBL_1522 (CHEMBL616156)
Ki
251±n/a nM
Citation
 Clitherow, JWScopes, DISkingle, MJordan, CCFeniuk, WCampbell, IBCarter, MCCollington, EWConnor, HEHiggins, GA Evolution of a novel series of [(N,N-dimethylamino)propyl]- and piperazinylbenzanilides as the first selective 5-HT1D antagonists. J Med Chem 37:2253-7 (1994)  
Target
Name:
5-hydroxytryptamine receptor 1A
Synonyms:
5-HT-1A 5-HT1A 5-hydroxytryptamine receptor 1A (5HT1A) 5ht1a Htr1a Serotonin 1a (5-HT1a) receptor/Adrenergic receptor alpha-1 | Serotonin receptor 1A
Type:
G Protein-Coupled Receptor (GPCR)
Mol. Mass.:
46445.29
Organism:
Rattus norvegicus (rat)
Description:
Binding assays were performed using rat hippocampal membranes.
Residue:
422
  
Inhibitor
Name:
BDBM50469881
Synonyms:
CHEMBL311150
Type:
Small organic molecule
Emp. Form.:
C29H34N4O3
Mol. Mass.:
486.6053
SMILES:
COc1ccc(NC(=O)c2ccc(cc2)-c2ccc(cc2C)C(=O)N(C)C)cc1N1CCN(C)CC1
: