Target
5-hydroxytryptamine receptor 1D
Ligand
BDBM50469876
Substrate
Meas. Tech.
ChEMBL_1667 (CHEMBL616658)
Ki
6.3±n/a nM
Citation
 Clitherow, JWScopes, DISkingle, MJordan, CCFeniuk, WCampbell, IBCarter, MCCollington, EWConnor, HEHiggins, GA Evolution of a novel series of [(N,N-dimethylamino)propyl]- and piperazinylbenzanilides as the first selective 5-HT1D antagonists. J Med Chem 37:2253-7 (1994)  
Target
Name:
5-hydroxytryptamine receptor 1D
Synonyms:
5-HT1D 5HT1D_CAVPO Serotonin 1d (5-HT1d) receptor
Type:
Enzyme Catalytic Domain
Mol. Mass.:
41780.38
Organism:
GUINEA PIG
Description:
5-HT1D HTR1D GUINEA PIG::Q60484
Residue:
376
  
Inhibitor
Name:
BDBM50469876
Synonyms:
CHEMBL306384
Type:
Small organic molecule
Emp. Form.:
C29H31N5O3
Mol. Mass.:
497.5881
SMILES:
COc1ccc(cc1N1CCN(C)CC1)C(=O)Nc1ccc(cc1)-c1ccc(cc1C)-c1noc(C)n1
: