Target
Type-1 angiotensin II receptor A/B
Ligand
BDBM50470330
Substrate
Meas. Tech.
ChEMBL_35116 (CHEMBL647025)
Ki
12±n/a nM
Citation
 Harmat, NJGiorgi, RBonaccorsi, FCerbai, GColombani, SMRenzetti, ARCirillo, RSubissi, AAlagona, GGhio, C 4-Diazinyl- and 4-pyridinylimidazoles: potent angiotensin II antagonists. A study of their activity and computational characterization. J Med Chem 38:2925-37 (1995)  
Target
Name:
Type-1 angiotensin II receptor A/B
Synonyms:
Angiotensin II receptor (AT-1) type-1 | Type-1A/Type-1B angiotensin II receptor
Type:
Mol. Mass.:
Description:
ASSAY_ID of ChEMBL is 901964
Components:
This complex has 2 components.
Component 1
Name:
Type-1 angiotensin II receptor B
Synonyms:
AGTRB_RAT Agtr1 Angiotensin II AT1B Angiotensin II type 1b (AT-1b) receptor Type-1B angiotensin II receptor
Type:
Enzyme Catalytic Domain
Mol. Mass.:
40929.44
Organism:
RAT
Description:
Angiotensin II AT1B 0 RAT::P29089
Residue:
359
  
Component 2
Name:
Type-1 angiotensin II receptor A
Synonyms:
AGTRA_RAT Agtr1 Angiotensin II AT1 Angiotensin II receptor (AT-1) type-1 Type-1A angiotensin II receptor
Type:
Enzyme Catalytic Domain
Mol. Mass.:
40910.53
Organism:
RAT
Description:
ANGIOTENSIN AT1 AGTR1 RAT::P25095
Residue:
359
  
Inhibitor
Name:
BDBM50470330
Synonyms:
CHEMBL318194
Type:
Small organic molecule
Emp. Form.:
C28H27N7O2
Mol. Mass.:
493.5597
SMILES:
CCCCc1nc(cn1Cc1ccc(cc1)-c1ccccc1-c1nn[nH]n1)-c1ccc(cn1)C(=O)OC
: