Target
Estrogen receptor beta
Ligand
BDBM50471264
Substrate
Meas. Tech.
ChEMBL_103160 (CHEMBL707870)
IC50
3.0±n/a nM
Citation
 Lobaccaro, CPons, JFDuchesne, MJAuzou, GPons, MNique, FTeutsch, GBorgna, JL Steroidal affinity labels of the estrogen receptor. 3. Estradiol 11 beta-n-alkyl derivatives bearing a terminal electrophilic group: antiestrogenic and cytotoxic properties. J Med Chem 40:2217-27 (1997)  
Target
Name:
Estrogen receptor beta
Synonyms:
Estrogen receptor
Type:
Mol. Mass.:
Description:
ASSAY_ID of ChEMBL is 99778
Components:
This complex has 2 components.
Component 1
Name:
Estrogen receptor beta
Synonyms:
ER-beta ESR2_HUMAN Estradiol receptor beta (ERβ) Estrogen receptor (ER beta) Estrogen receptor beta (ER beta) NR3A2 estrogen beta
Type:
Protein
Mol. Mass.:
59238.43
Organism:
Homo sapiens (Human)
Description:
Q92731
Residue:
530
  
Component 2
Name:
Estrogen receptor
Synonyms:
ER ESR ESR1_HUMAN Estrogen receptor Estrogen receptor (ER-alpha) Estrogen receptor alpha (ER) Nuclear receptor subfamily 3 group A member 1
Type:
Protein
Mol. Mass.:
66230.44
Organism:
Homo sapiens (Human)
Description:
P03372
Residue:
595
  
Inhibitor
Name:
BDBM50471264
Synonyms:
CHEMBL1627893
Type:
Small organic molecule
Emp. Form.:
C22H31BrO2
Mol. Mass.:
407.384
SMILES:
[H][C@@]12CC[C@H](O)[C@@]1(C)C[C@H](CCCCBr)[C@]1([H])c3ccc(O)cc3CC[C@@]21[H]
: