Target
Cysteinyl leukotriene receptor 1/2
Ligand
BDBM50471559
Substrate
Meas. Tech.
ChEMBL_52207 (CHEMBL664841)
Kd
239±n/a nM
Citation
 Zwaagstra, METimmerman, HTamura, MTohma, TWada, YOnogi, KZhang, MQ Synthesis and structure-activity relationships of carboxylated chalcones: a novel series of CysLT1 (LTD4) receptor antagonists. J Med Chem 40:1075-89 (1997)  
Target
Name:
Cysteinyl leukotriene receptor 1/2
Synonyms:
Cysteinyl leukotriene receptor
Type:
Mol. Mass.:
Description:
ASSAY_ID of ChEMBL is 98640
Components:
This complex has 2 components.
Component 1
Name:
Cysteinyl leukotriene receptor 1
Synonyms:
CLTR1_HUMAN CYSLTR1 Cysteinyl leukotriene receptor HG55 LTD4 receptor | Leukotriene Cysteinyl 1
Type:
Enzyme Catalytic Domain
Mol. Mass.:
38565.16
Organism:
Homo sapiens (Human)
Description:
Leukotriene Cysteinyl 1 CYSLTR1 HUMAN::Q9Y271
Residue:
337
  
Component 2
Name:
Cysteinyl leukotriene receptor 2
Synonyms:
CLTR2_HUMAN CYSLT2R Cysteinyl leukotriene receptor Leukotriene Cysteinyl 2
Type:
Enzyme Catalytic Domain
Mol. Mass.:
39657.52
Organism:
Homo sapiens (Human)
Description:
Leukotriene Cysteinyl 2 CYSLTR2 HUMAN::Q9NS75
Residue:
346
  
Inhibitor
Name:
BDBM50471559
Synonyms:
CHEMBL11902
Type:
Small organic molecule
Emp. Form.:
C27H18ClN5O2
Mol. Mass.:
479.917
SMILES:
Oc1ccc(cc1C(=O)\C=C\c1ccc(\C=C\c2ccc3ccc(Cl)cc3n2)cc1)-c1nn[nH]n1
: