Target
Alpha-1A adrenergic receptor
Ligand
BDBM30712
Substrate
Meas. Tech.
ChEMBL_33265 (CHEMBL643604)
Ki
16±n/a nM
Citation
 Hodson, SJBishop, MJSpeake, JDNavas, FGarrison, DTBigham, ECSaussy, DLLiacos, JAIrving, PEGobel, MJSherman, BW 2-(Anilinomethyl)imidazolines as alpha1 adrenergic receptor agonists: the discovery of alpha1a subtype selective 2'-alkylsulfonyl-substituted analogues. J Med Chem 45:2229-39 (2002)  
Target
Name:
Alpha-1A adrenergic receptor
Synonyms:
ADA1A_HUMAN ADRA1C Alpha 1A-adrenoceptor Alpha adrenergic receptor 1a Alpha-adrenergic receptor 1c adrenergic Alpha1 | adrenergic Alpha1C
Type:
Cell-surface receptors
Mol. Mass.:
51511.67
Organism:
Homo sapiens (Human)
Description:
P35348
Residue:
466
  
Inhibitor
Name:
BDBM30712
Synonyms:
6-tert-butyl-3-(2-imidazolin-2-ylmethyl)-2,4-dimethyl-phenol;hydrochloride 6-tert-butyl-3-(4,5-dihydro-1H-imidazol-2-ylmethyl)-2,4-dimethylphenol;hydrochloride Oxymetazoline cid_66259
Type:
Small organic molecule
Emp. Form.:
C16H24N2O
Mol. Mass.:
260.3746
SMILES:
Cc1cc(c(O)c(C)c1CC1=NCCN1)C(C)(C)C
: