Target
UDP-N-acetylmuramate--L-alanine ligase
Ligand
BDBM50475581
Substrate
Meas. Tech.
ChEMBL_328936 (CHEMBL859886)
IC50
38600±n/a nM
Citation
 Antane, SCaufield, CEHu, WKeeney, DLabthavikul, PMorris, KNaughton, SMPetersen, PJRasmussen, BASingh, GYang, Y Pulvinones as bacterial cell wall biosynthesis inhibitors. Bioorg Med Chem Lett 16:176-80 (2006)  
Target
Name:
UDP-N-acetylmuramate--L-alanine ligase
Synonyms:
MURC_ECOLI UDP-N-acetylmuramate--L-alanine ligase | murC
Type:
Protein
Mol. Mass.:
53617.78
Organism:
Escherichia coli
Description:
P17952
Residue:
491
  
Inhibitor
Name:
BDBM50475581
Synonyms:
CHEMBL382548
Type:
Small organic molecule
Emp. Form.:
C19H13F3O4
Mol. Mass.:
362.2993
SMILES:
COc1ccc(cc1)C1=C(O)O\C(=C/c2cccc(c2)C(F)(F)F)C1=O
: