Target
UDP-N-acetylmuramate--L-alanine ligase
Ligand
BDBM50475588
Substrate
Meas. Tech.
ChEMBL_328936 (CHEMBL859886)
IC50
20000±n/a nM
Citation
 Antane, SCaufield, CEHu, WKeeney, DLabthavikul, PMorris, KNaughton, SMPetersen, PJRasmussen, BASingh, GYang, Y Pulvinones as bacterial cell wall biosynthesis inhibitors. Bioorg Med Chem Lett 16:176-80 (2006)  
Target
Name:
UDP-N-acetylmuramate--L-alanine ligase
Synonyms:
MURC_ECOLI UDP-N-acetylmuramate--L-alanine ligase | murC
Type:
Protein
Mol. Mass.:
53617.78
Organism:
Escherichia coli
Description:
P17952
Residue:
491
  
Inhibitor
Name:
BDBM50475588
Synonyms:
CHEMBL197865
Type:
Small organic molecule
Emp. Form.:
C21H13ClO3
Mol. Mass.:
348.779
SMILES:
OC1=C(C(=O)O\C1=C/c1cccc2ccccc12)c1ccc(Cl)cc1
: