Target
Tubulin beta chain
Ligand
BDBM50476048
Substrate
Meas. Tech.
ChEMBL_422811 (CHEMBL856530)
IC50
500±n/a nM
Citation
 Zuse, ASchmidt, PBaasner, SBöhm, KJMüller, KGerlach, MGünther, EGUnger, EPrinz, H 9-Benzylidene-naphtho[2,3-b]thiophen-4-ones as novel antimicrotubule agents-synthesis, antiproliferative activity, and inhibition of tubulin polymerization. J Med Chem 49:7816-25 (2006)  
Target
Name:
Tubulin beta chain
Synonyms:
Beta-tubulin Tubulin beta chain
Type:
PROTEIN
Mol. Mass.:
49840.26
Organism:
Sus scrofa
Description:
ChEMBL_105107
Residue:
445
  
Inhibitor
Name:
BDBM50476048
Synonyms:
CHEMBL219439
Type:
Small organic molecule
Emp. Form.:
C21H16O4S
Mol. Mass.:
364.414
SMILES:
COc1ccc(\C=C2/c3sccc3C(=O)c3ccccc23)c(OC)c1O
: