Target
Reverse transcriptase protein
Ligand
BDBM2483
Substrate
Meas. Tech.
ChEMBL_450286 (CHEMBL900567)
Ki
3000±n/a nM
Citation
 Mai, AArtico, MRotili, DTarantino, DClotet-Codina, IArmand-Ugón, MRagno, RSimeoni, SSbardella, GNawrozkij, MBSamuele, AMaga, GEsté, JA Synthesis and biological properties of novel 2-aminopyrimidin-4(3H)-ones highly potent against HIV-1 mutant strains. J Med Chem 50:5412-24 (2007)  
Target
Name:
Reverse transcriptase protein
Synonyms:
Reverse Transcriptase Reverse Transcriptase (F61A)
Type:
Protein
Mol. Mass.:
30203.56
Organism:
Human immunodeficiency virus 1
Description:
Q9WJQ2
Residue:
259
  
Inhibitor
Name:
BDBM2483
Synonyms:
(4S)-6-chloro-4-(2-cyclopropylethynyl)-4-(trifluoromethyl)-2,4-dihydro-1H-3,1-benzoxazin-2-one DMP-266 Efavirenz L-743,726 | Sustiva
Type:
Small organic molecule
Emp. Form.:
C14H9ClF3NO2
Mol. Mass.:
315.675
SMILES:
FC(F)(F)[C@]1(OC(=O)Nc2ccc(Cl)cc12)C#CC1CC1
: