Target
Reverse transcriptase protein
Ligand
BDBM1434
Substrate
Meas. Tech.
ChEMBL_450287 (CHEMBL900568)
Ki
9000±n/a nM
Citation
 Mai, AArtico, MRotili, DTarantino, DClotet-Codina, IArmand-Ugón, MRagno, RSimeoni, SSbardella, GNawrozkij, MBSamuele, AMaga, GEsté, JA Synthesis and biological properties of novel 2-aminopyrimidin-4(3H)-ones highly potent against HIV-1 mutant strains. J Med Chem 50:5412-24 (2007)  
Target
Name:
Reverse transcriptase protein
Synonyms:
Reverse Transcriptase Reverse Transcriptase (F61A)
Type:
Protein
Mol. Mass.:
30203.56
Organism:
Human immunodeficiency virus 1
Description:
Q9WJQ2
Residue:
259
  
Inhibitor
Name:
BDBM1434
Synonyms:
11-cyclopropyl-5,11-dihydro-4-methyl-6H-dipyrido[3,2-b:2 ,3 -e][1,4]diazepin-6-one BI-RG-587 Nevirapine US11420959, Example NVP | Viramune
Type:
Small organic molecule
Emp. Form.:
C15H14N4O
Mol. Mass.:
266.2979
SMILES:
Cc1ccnc2N(C3CC3)c3ncccc3C(=O)Nc12
: