Target
Reverse transcriptase
Ligand
BDBM1434
Substrate
Meas. Tech.
ChEMBL_450288 (CHEMBL900569)
Ki
10000±n/a nM
Citation
 Mai, AArtico, MRotili, DTarantino, DClotet-Codina, IArmand-Ugón, MRagno, RSimeoni, SSbardella, GNawrozkij, MBSamuele, AMaga, GEsté, JA Synthesis and biological properties of novel 2-aminopyrimidin-4(3H)-ones highly potent against HIV-1 mutant strains. J Med Chem 50:5412-24 (2007)  
Target
Name:
Reverse transcriptase
Synonyms:
Type:
Protein
Mol. Mass.:
29598.37
Organism:
Human immunodeficiency virus 1
Description:
Q9WKE8
Residue:
254
  
Inhibitor
Name:
BDBM1434
Synonyms:
11-cyclopropyl-5,11-dihydro-4-methyl-6H-dipyrido[3,2-b:2 ,3 -e][1,4]diazepin-6-one BI-RG-587 Nevirapine US11420959, Example NVP | Viramune
Type:
Small organic molecule
Emp. Form.:
C15H14N4O
Mol. Mass.:
266.2979
SMILES:
Cc1ccnc2N(C3CC3)c3ncccc3C(=O)Nc12
: