Target
Reverse transcriptase
Ligand
BDBM50478158
Substrate
Meas. Tech.
ChEMBL_471453 (CHEMBL952768)
IC50
1300±n/a nM
Citation
 Lennerstrand, JChu, CKSchinazi, RF Biochemical studies on the mechanism of human immunodeficiency virus type 1 reverse transcriptase resistance to 1-(beta-D-dioxolane)thymine triphosphate. Antimicrob Agents Chemother 51:2078-84 (2007)  
Target
Name:
Reverse transcriptase
Synonyms:
Type:
Protein
Mol. Mass.:
29598.37
Organism:
Human immunodeficiency virus 1
Description:
Q9WKE8
Residue:
254
  
Inhibitor
Name:
BDBM50478158
Synonyms:
Tenofovir diphospahte | tenofovir diphosphate
Type:
Small organic molecule
Emp. Form.:
C9H16N5O10P3
Mol. Mass.:
447.1721
SMILES:
C[C@@H](Cn1cnc2c(N)ncnc12)OCP(O)(=O)OP(O)(=O)OP(O)(O)=O
: