Target
DNA gyrase subunit A
Ligand
BDBM50366824
Substrate
Meas. Tech.
ChEMBL_554862 (CHEMBL957239)
IC50
227000±n/a nM
Citation
 Cheng, JThanassi, JAThoma, CLBradbury, BJDeshpande, MPucci, MJ Dual targeting of DNA gyrase and topoisomerase IV: target interactions of heteroaryl isothiazolones in Staphylococcus aureus. Antimicrob Agents Chemother 51:2445-53 (2007)  
Target
Name:
DNA gyrase subunit A
Synonyms:
DNA gyrase subunit A (gyrA) gyrA
Type:
Enzyme Subunit
Mol. Mass.:
99588.82
Organism:
Staphylococcus aureus
Description:
Residue:
889
  
Inhibitor
Name:
BDBM50366824
Synonyms:
Avelox Moxifl-oxacin
Type:
Small organic molecule
Emp. Form.:
C21H24FN3O4
Mol. Mass.:
401.4314
SMILES:
COc1c(N2C[C@@H]3CCCN[C@@H]3C2)c(F)cc2c1n(cc(C(O)=O)c2=O)C1CC1
: