Target
Reverse transcriptase protein
Ligand
BDBM50479681
Substrate
Meas. Tech.
ChEMBL_516596 (CHEMBL988683)
Ki
65±n/a nM
Citation
 Radi, MMaga, GAlongi, MAngeli, LSamuele, AZanoli, SBellucci, LTafi, ACasaluce, GGiorgi, GArmand-Ugon, MGonzalez, EEsté, JABaltzinger, MBec, GDumas, PEnnifar, EBotta, M Discovery of chiral cyclopropyl dihydro-alkylthio-benzyl-oxopyrimidine (S-DABO) derivatives as potent HIV-1 reverse transcriptase inhibitors with high activity against clinically relevant mutants. J Med Chem 52:840-51 (2009)  
Target
Name:
Reverse transcriptase protein
Synonyms:
Reverse Transcriptase Reverse Transcriptase (F61A)
Type:
Protein
Mol. Mass.:
30203.56
Organism:
Human immunodeficiency virus 1
Description:
Q9WJQ2
Residue:
259
  
Inhibitor
Name:
BDBM50479681
Synonyms:
CHEMBL478258
Type:
Small organic molecule
Emp. Form.:
C24H24F2N2O2S
Mol. Mass.:
442.521
SMILES:
[H][C@@]1(CSc2nc([C@H](C)c3c(F)cccc3F)c(C)c(=O)[nH]2)C[C@@]1([H])c1ccc(OC)cc1
: