Target
Reverse transcriptase protein
Ligand
BDBM1434
Substrate
Meas. Tech.
ChEMBL_516598 (CHEMBL988685)
Ki
5000±n/a nM
Citation
 Radi, MMaga, GAlongi, MAngeli, LSamuele, AZanoli, SBellucci, LTafi, ACasaluce, GGiorgi, GArmand-Ugon, MGonzalez, EEsté, JABaltzinger, MBec, GDumas, PEnnifar, EBotta, M Discovery of chiral cyclopropyl dihydro-alkylthio-benzyl-oxopyrimidine (S-DABO) derivatives as potent HIV-1 reverse transcriptase inhibitors with high activity against clinically relevant mutants. J Med Chem 52:840-51 (2009)  
Target
Name:
Reverse transcriptase protein
Synonyms:
Reverse Transcriptase Reverse Transcriptase (F61A)
Type:
Protein
Mol. Mass.:
30203.56
Organism:
Human immunodeficiency virus 1
Description:
Q9WJQ2
Residue:
259
  
Inhibitor
Name:
BDBM1434
Synonyms:
11-cyclopropyl-5,11-dihydro-4-methyl-6H-dipyrido[3,2-b:2 ,3 -e][1,4]diazepin-6-one BI-RG-587 Nevirapine US11420959, Example NVP | Viramune
Type:
Small organic molecule
Emp. Form.:
C15H14N4O
Mol. Mass.:
266.2979
SMILES:
Cc1ccnc2N(C3CC3)c3ncccc3C(=O)Nc12
: