Target
Protease
Ligand
BDBM50479982
Substrate
Meas. Tech.
ChEMBL_544292 (CHEMBL1020430)
Ki
0.008±n/a nM
Citation
 Hazen, RHarvey, RFerris, RCraig, CYates, PGriffin, PMiller, JKaldor, IRay, JSamano, VFurfine, ESpaltenstein, AHale, MTung, RSt Clair, MHanlon, MBoone, L In vitro antiviral activity of the novel, tyrosyl-based human immunodeficiency virus (HIV) type 1 protease inhibitor brecanavir (GW640385) in combination with other antiretrovirals and against a panel of protease inhibitor-resistant HIV. Antimicrob Agents Chemother 51:3147-54 (2007)  
Target
Name:
Protease
Synonyms:
Type:
Enzyme
Mol. Mass.:
10904.79
Organism:
Human immunodeficiency virus 1 (HIV-1)
Description:
Q9YQ12
Residue:
99
  
Inhibitor
Name:
BDBM50479982
Synonyms:
Aptivus Tipranavir US10806794, Compound Tipranavir
Type:
Small organic molecule
Emp. Form.:
C31H33F3N2O5S
Mol. Mass.:
602.664
SMILES:
CCC[C@@]1(CCc2ccccc2)CC(O)=C([C@H](CC)c2cccc(NS(=O)(=O)c3ccc(cn3)C(F)(F)F)c2)C(=O)O1
: