Target
Protease
Ligand
BDBM50480929
Substrate
Meas. Tech.
ChEMBL_593880 (CHEMBL1037773)
Ki
0.830000±n/a nM
Citation
 Hidaka, KKimura, TAbdel-Rahman, HMNguyen, JTMcDaniel, KFKohlbrenner, WEMolla, AAdachi, MTamada, TKuroki, RKatsuki, NTanaka, YMatsumoto, HWang, JHayashi, YKempf, DJKiso, Y Small-sized human immunodeficiency virus type-1 protease inhibitors containing allophenylnorstatine to explore the S2' pocket. J Med Chem 52:7604-17 (2009)  
Target
Name:
Protease
Synonyms:
Type:
Enzyme
Mol. Mass.:
10904.79
Organism:
Human immunodeficiency virus 1 (HIV-1)
Description:
Q9YQ12
Residue:
99
  
Inhibitor
Name:
BDBM50480929
Synonyms:
CHEMBL573975 | KNI-1689
Type:
Small organic molecule
Emp. Form.:
C30H40N4O5S
Mol. Mass.:
568.727
SMILES:
CC(=C)CNC(=O)[C@H]1N(CSC1(C)C)C(=O)[C@@H](O)[C@H](Cc1ccccc1)NC(=O)COc1c(C)cc(N)cc1C
: