Target
DNA gyrase subunit B
Ligand
BDBM50366824
Substrate
Meas. Tech.
ChEMBL_678249 (CHEMBL1280244)
IC50
6000±n/a nM
Citation
 Matrat, SAubry, AMayer, CJarlier, VCambau, E Mutagenesis in the alpha3alpha4 GyrA helix and in the Toprim domain of GyrB refines the contribution of Mycobacterium tuberculosis DNA gyrase to intrinsic resistance to quinolones. Antimicrob Agents Chemother 52:2909-14 (2008)  
Target
Name:
DNA gyrase subunit B
Synonyms:
5.6.2.2 GYRB_MYCTU | gyrB
Type:
PROTEIN
Mol. Mass.:
74087.83
Organism:
Mycobacterium tuberculosis (strain ATCC 25618 / H37Rv)
Description:
ChEMBL_109655
Residue:
675
  
Inhibitor
Name:
BDBM50366824
Synonyms:
Avelox Moxifl-oxacin
Type:
Small organic molecule
Emp. Form.:
C21H24FN3O4
Mol. Mass.:
401.4314
SMILES:
COc1c(N2C[C@@H]3CCCN[C@@H]3C2)c(F)cc2c1n(cc(C(O)=O)c2=O)C1CC1
: