Target
Histamine H4 receptor
Ligand
BDBM50483134
Substrate
Meas. Tech.
ChEMBL_697519 (CHEMBL1638851)
EC50
13±n/a nM
Citation
 Igel, PDove, SBuschauer, A Histamine H4 receptor agonists. Bioorg Med Chem Lett 20:7191-9 (2010)  
Target
Name:
Histamine H4 receptor
Synonyms:
AXOR35 GPCR105 HH4R HRH4 Histamine H4 receptor Histamine receptor (H3 and H4) SP9144
Type:
G Protein-Coupled Receptor (GPCR)
Mol. Mass.:
44517.02
Organism:
Homo sapiens (Human)
Description:
Binding assays were using CHO cells stably expressing hH4R receptors.
Residue:
390
  
Inhibitor
Name:
BDBM50483134
Synonyms:
CHEBI:64156 | Imetit
Type:
Small organic molecule
Emp. Form.:
C6H10N4S
Mol. Mass.:
170.235
SMILES:
NC(=N)SCCc1c[nH]cn1
: