Target
Thymidine phosphorylase
Ligand
BDBM50483637
Substrate
Meas. Tech.
ChEMBL_739793 (CHEMBL1762853)
IC50
292000±n/a nM
Citation
 Rajabi, MMansell, DFreeman, SBryce, RA Structure-activity relationship of 2,4,5-trioxoimidazolidines as inhibitors of thymidine phosphorylase. Eur J Med Chem 46:1165-71 (2011)  
Target
Name:
Thymidine phosphorylase
Synonyms:
TYPH_ECOLI Thymidine Phosphorylase (TP) tpp | ttg
Type:
Enzyme
Mol. Mass.:
47198.54
Organism:
Escherichia coli
Description:
Residue:
440
  
Inhibitor
Name:
BDBM50483637
Synonyms:
CHEMBL1762073
Type:
Small organic molecule
Emp. Form.:
C14H13ClN2O5
Mol. Mass.:
324.716
SMILES:
CCOC(=O)CN1C(=O)N(Cc2cccc(Cl)c2)C(=O)C1=O
: