Target
Solute carrier family 22 member 2
Ligand
BDBM39687
Substrate
Meas. Tech.
ChEMBL_838310 (CHEMBL2076808)
Ki
100±n/a nM
Citation
 Gorboulev, VUlzheimer, JCAkhoundova, AUlzheimer-Teuber, IKarbach, UQuester, SBaumann, CLang, FBusch, AEKoepsell, H Cloning and characterization of two human polyspecific organic cation transporters. DNA Cell Biol 16:871-81 (1997)  
Target
Name:
Solute carrier family 22 member 2
Synonyms:
OCT2 S22A2_HUMAN hOCT2
Type:
PROTEIN
Mol. Mass.:
62591.01
Organism:
Homo sapiens (Human)
Description:
ChEMBL_1484077
Residue:
555
  
Inhibitor
Name:
BDBM39687
Synonyms:
(2E)-1-ethyl-2-[(1-ethyl-2-quinolin-1-iumyl)methylidene]quinoline;chloride (2E)-1-ethyl-2-[(1-ethylquinolin-1-ium-2-yl)methylidene]quinoline;chloride CHEMBL1197556 SMR000137574 | cid_5717105
Type:
Small organic molecule
Emp. Form.:
C23H23N2
Mol. Mass.:
327.4416
SMILES:
CCN1\C(=C\c2ccc3ccccc3[n+]2CC)C=Cc2ccccc12
: