Target
ATP-binding cassette sub-family C member 2
Ligand
BDBM50485566
Substrate
Meas. Tech.
ChEMBL_839174 (CHEMBL2077845)
Ki
96600±n/a nM
Citation
 Chu, XYKato, YNiinuma, KSudo, KIHakusui, HSugiyama, Y Multispecific organic anion transporter is responsible for the biliary excretion of the camptothecin derivative irinotecan and its metabolites in rats. J Pharmacol Exp Ther 281:304-14 (1997) Target
Name:
ATP-binding cassette sub-family C member 2
Synonyms:
ATP-binding cassette sub-family C member 2 Canalicular multidrug resistance protein Cmoat MRP2_RAT Multidrug resistance-associated protein 2
Type:
PROTEIN
Mol. Mass.:
173415.22
Organism:
Rattus norvegicus
Description:
ChEMBL_1455464
Residue:
1541
  
Inhibitor
Name:
BDBM50485566
Synonyms:
CHEMBL2074712
Type:
Small organic molecule
Emp. Form.:
C33H40N4O7
Mol. Mass.:
604.6933
SMILES:
CCc1c2Cn3c(cc(c(CO)c3=O)[C@@](O)(CC)C(O)=O)-c2nc2ccc(OC(=O)N3CCC(CC3)N3CCCCC3)cc12
: