Target
Solute carrier family 22 member 8
Ligand
BDBM50482777
Substrate
Meas. Tech.
ChEMBL_838483 (CHEMBL2076054)
IC50
800000±n/a nM
Citation
 Jung, KYTakeda, MShimoda, MNarikawa, STojo, AKim, DKChairoungdua, AChoi, BKKusuhara, HSugiyama, YSekine, TEndou, H Involvement of rat organic anion transporter 3 (rOAT3) in cephaloridine-induced nephrotoxicity: in comparison with rOAT1. Life Sci 70:1861-74 (2002)  
Target
Name:
Solute carrier family 22 member 8
Synonyms:
Oat3 S22A8_RAT rOat3
Type:
PROTEIN
Mol. Mass.:
59199.83
Organism:
Rattus norvegicus
Description:
ChEMBL_1482580
Residue:
536
  
Inhibitor
Name:
BDBM50482777
Synonyms:
CHEBI:204928 | Cefotaxime
Type:
Small organic molecule
Emp. Form.:
C16H17N5O7S2
Mol. Mass.:
455.465
SMILES:
[H][C@]12SCC(COC(C)=O)=C(N1C(=O)[C@H]2NC(=O)C(=N/OC)\c1csc(N)n1)C(O)=O
: